Reaction Details
TargetHistone deacetylase 4 [648-729,745-1057]
LigandBDBM257508
Substrate/CompetitorUS9505736, Boc-Lys(Tfa)-AMC
Meas. Tech.Biochemical Assay
pH8±n/a
Temperature298.15±n/a K
IC50 20±n/a nM
Commentsextracted
Citation Dominguez, CBreccia, PLuckhurst, CABürli, RWStott, AJ Histone deacetylase inhibitors and compositions and methods of use thereof US Patent US9505736 Publication Date 11/29/2016
 
Histone deacetylase 4 [648-729,745-1057]
Name:Histone deacetylase 4 [648-729,745-1057]
Type:Enzyme
Mol. Mass.:43928.30
Organism:Homo sapiens (Human)
Description:amino acids 648-1057, replacement of amino acids 730-744 with 4 amino acid GSGS
Residue:410
BDBM257508
US9505736, Boc-Lys(Tfa)-AMC
NameBDBM257508
Synonyms:US9505736, (1S,2S,3S)-2-(4-(2-Cyclopropyloxazol- 5-yl)phenyl)-1-fluoro-N-hydroxy-3- phenylcyclopropanecarboxamide
TypeSmall organic molecule
Emp. Form.C22H19FN2O3
Mol. Mass.378.3963
SMILESONC(=O)[C@]1(F)[C@@H]([C@H]1c1ccc(cc1)-c1cnc(o1)C1CC1)c1ccccc1