Reaction Details
TargetEctonucleotide pyrophosphatase/phosphodiesterase family member 2
LigandBDBM258501
Substrate/Competitorn/a
Meas. Tech.Enzyme Inhibition Assay
pH8±n/a
Temperature303.15±n/a K
IC50 1±n/a nM
Commentsextracted
Citation Hunziker, DMattei, PMauser, HPrunotto, MUllmer, C Diazaspirocycloalkane and azaspirocycloalkane US Patent US9493486 Publication Date 11/15/2016
 
Ectonucleotide pyrophosphatase/phosphodiesterase family member 2
Name:Ectonucleotide pyrophosphatase/phosphodiesterase family member 2
Type:Enzyme
Mol. Mass.:99007.13
Organism:Homo sapiens (Human)
Description:Q13822
Residue:863
BDBM258501
NameBDBM258501
Synonyms:US10633384, Example 1.23 | US9493486, 1.23
TypeSmall organic molecule
Emp. Form.C23H23F4N3O6S
Mol. Mass.545.504
SMILESNS(=O)(=O)c1ccc(cc1)C(=O)N1CC2(C1)CCN(CC2)C(=O)OCc1ccc(OC(F)(F)F)cc1F