Reaction Details
TargetEctonucleotide pyrophosphatase/phosphodiesterase family member 2
LigandBDBM258505
Substrate/Competitorn/a
Meas. Tech.Enzyme Inhibition Assay
pH8±n/a
Temperature303.15±n/a K
IC50 41±n/a nM
Commentsextracted
Citation Hunziker, DMattei, PMauser, HPrunotto, MUllmer, C Diazaspirocycloalkane and azaspirocycloalkane US Patent US9493486 Publication Date 11/15/2016
 
Ectonucleotide pyrophosphatase/phosphodiesterase family member 2
Name:Ectonucleotide pyrophosphatase/phosphodiesterase family member 2
Type:Enzyme
Mol. Mass.:99007.13
Organism:Homo sapiens (Human)
Description:Q13822
Residue:863
BDBM258505
NameBDBM258505
Synonyms:US10633384, Example 1.27 | US9493486, 1.27
TypeSmall organic molecule
Emp. Form.C25H32ClN5O3
Mol. Mass.486.006
SMILESCC(C)c1cc(Cl)ccc1OCC(=O)N1CCC2(CN(C2)C(=O)C2CCc3[nH]nnc3C2)CC1