Reaction Details
TargetEctonucleotide pyrophosphatase/phosphodiesterase family member 2
LigandBDBM258570
Substrate/Competitorn/a
Meas. Tech.Enzyme Inhibition Assay
pH8±n/a
Temperature303.15±n/a K
IC50 44±n/a nM
Commentsextracted
Citation Hunziker, DMattei, PMauser, HPrunotto, MUllmer, C Diazaspirocycloalkane and azaspirocycloalkane US Patent US9493486 Publication Date 11/15/2016
 
Ectonucleotide pyrophosphatase/phosphodiesterase family member 2
Name:Ectonucleotide pyrophosphatase/phosphodiesterase family member 2
Type:Enzyme
Mol. Mass.:99007.13
Organism:Homo sapiens (Human)
Description:Q13822
Residue:863
BDBM258570
NameBDBM258570
Synonyms:US10633384, Example 12.32 | US9493486, 12.32
TypeSmall organic molecule
Emp. Form.C20H23Cl2N5O3
Mol. Mass.452.334
SMILESClc1cc(Cl)cc(COC(=O)N2CCC3(CC(C3)C(=O)NCc3cnn[nH]3)CC2)c1