Reaction Details
TargetEctonucleotide pyrophosphatase/phosphodiesterase family member 2
LigandBDBM258571
Substrate/Competitorn/a
Meas. Tech.Enzyme Inhibition Assay
pH8±n/a
Temperature303.15±n/a K
IC50 13±n/a nM
Commentsextracted
Citation Hunziker, DMattei, PMauser, HPrunotto, MUllmer, C Diazaspirocycloalkane and azaspirocycloalkane US Patent US9493486 Publication Date 11/15/2016
 
Ectonucleotide pyrophosphatase/phosphodiesterase family member 2
Name:Ectonucleotide pyrophosphatase/phosphodiesterase family member 2
Type:Enzyme
Mol. Mass.:99007.13
Organism:Homo sapiens (Human)
Description:Q13822
Residue:863
BDBM258571
NameBDBM258571
Synonyms:US10633384, Example 12.33 | US9493486, 12.33
TypeSmall organic molecule
Emp. Form.C23H25F4N5O4
Mol. Mass.511.4693
SMILESFc1cc(COC(=O)N2CC3(C2)CCN(CC3)C(=O)C2CCc3[nH]nnc3C2)ccc1OC(F)(F)F