Reaction Details
TargetEctonucleotide pyrophosphatase/phosphodiesterase family member 2
LigandBDBM258576
Substrate/Competitorn/a
Meas. Tech.Enzyme Inhibition Assay
pH8±n/a
Temperature303.15±n/a K
IC50 2.5±n/a nM
Commentsextracted
Citation Hunziker, DMattei, PMauser, HPrunotto, MUllmer, C Diazaspirocycloalkane and azaspirocycloalkane US Patent US9493486 Publication Date 11/15/2016
 
Ectonucleotide pyrophosphatase/phosphodiesterase family member 2
Name:Ectonucleotide pyrophosphatase/phosphodiesterase family member 2
Type:Enzyme
Mol. Mass.:99007.13
Organism:Homo sapiens (Human)
Description:Q13822
Residue:863
BDBM258576
NameBDBM258576
Synonyms:US10633384, Example 12.38 | US9493486, 12.38
TypeSmall organic molecule
Emp. Form.C24H27F4N5O4
Mol. Mass.525.4959
SMILESFc1cc(OCC(F)(F)F)ccc1COC(=O)N1CCC2(CN(C2)C(=O)C2CCc3nn[nH]c3C2)CC1