Reaction Details
TargetTyrosine-protein kinase BTK
LigandBDBM259406
Substrate/Competitorn/a
Meas. Tech.Biochemical Enzyme Assay
pH7.5±n/a
Temperature303.15±n/a K
IC50 4±n/a nM
Commentsextracted
Citation Angst, DGessier, FVulpetti, A Amino pyrimidine derivatives US Patent US9512084 Publication Date 12/6/2016
 
Tyrosine-protein kinase BTK
Name:Tyrosine-protein kinase BTK
Type:Enzyme
Mol. Mass.:76289.95
Organism:Homo sapiens (Human)
Description:Q06187
Residue:659
BDBM259406
NameBDBM259406
Synonyms:US10457647, Example 5 US11673868, Example 5 | US9512084, 5
TypeSmall organic molecule
Emp. Form.C29H29F2N5O3
Mol. Mass.533.5691
SMILESCc1c(NC(=O)c2ccc(cc2F)C2CC2)cc(F)cc1-c1ncnc(N)c1OC1CCN(CC1)C(=O)C=C