Reaction Details
TargetTyrosine-protein kinase BTK
LigandBDBM259413
Substrate/Competitorn/a
Meas. Tech.Biochemical Enzyme Assay
pH7.5±n/a
Temperature303.15±n/a K
IC50 12±n/a nM
Commentsextracted
Citation Angst, DGessier, FVulpetti, A Amino pyrimidine derivatives US Patent US9512084 Publication Date 12/6/2016
 
Tyrosine-protein kinase BTK
Name:Tyrosine-protein kinase BTK
Type:Enzyme
Mol. Mass.:76289.95
Organism:Homo sapiens (Human)
Description:Q06187
Residue:659
BDBM259413
NameBDBM259413
Synonyms:US10457647, Example 12 US11673868, Example 12 | US9512084, 12
TypeSmall organic molecule
Emp. Form.C28H26FN5O3
Mol. Mass.499.5361
SMILESCN(CCOc1c(N)ncnc1-c1cccc(c1)-n1ccc2cc(cc(F)c2c1=O)C1CC1)C(=O)C=C