Reaction Details
TargetTyrosine-protein kinase BTK
LigandBDBM259420
Substrate/Competitorn/a
Meas. Tech.Biochemical Enzyme Assay
pH7.5±n/a
Temperature303.15±n/a K
IC50 16±n/a nM
Commentsextracted
Citation Angst, DGessier, FVulpetti, A Amino pyrimidine derivatives US Patent US9512084 Publication Date 12/6/2016
 
Tyrosine-protein kinase BTK
Name:Tyrosine-protein kinase BTK
Type:Enzyme
Mol. Mass.:76289.95
Organism:Homo sapiens (Human)
Description:Q06187
Residue:659
BDBM259420
NameBDBM259420
Synonyms:US10457647, Example 19 US11673868, Example 19 | US9512084, 19
TypeSmall organic molecule
Emp. Form.C28H29F2N5O3
Mol. Mass.521.5584
SMILESC[C@@H](COc1c(N)ncnc1-c1cc(F)cc(NC(=O)c2ccc(cc2F)C2CC2)c1C)N(C)C(=O)C=C