Reaction Details
TargetTyrosine-protein kinase BTK
LigandBDBM259430
Substrate/Competitorn/a
Meas. Tech.Biochemical Enzyme Assay
pH7.5±n/a
Temperature303.15±n/a K
IC50 4±n/a nM
Commentsextracted
Citation Angst, DGessier, FVulpetti, A Amino pyrimidine derivatives US Patent US9512084 Publication Date 12/6/2016
 
Tyrosine-protein kinase BTK
Name:Tyrosine-protein kinase BTK
Type:Enzyme
Mol. Mass.:76289.95
Organism:Homo sapiens (Human)
Description:Q06187
Residue:659
BDBM259430
NameBDBM259430
Synonyms:US10457647, Example 29 US11673868, Example 29 | US9512084, 29
TypeSmall organic molecule
Emp. Form.C30H31F2N5O4
Mol. Mass.563.595
SMILESCO[C@H]1C[C@@H](COc2c(N)ncnc2-c2cc(F)cc(NC(=O)c3ccc(cc3F)C3CC3)c2C)N(C1)C(=O)C=C