Reaction Details
TargetTyrosine-protein kinase BTK
LigandBDBM259433
Substrate/Competitorn/a
Meas. Tech.Biochemical Enzyme Assay
pH7.5±n/a
Temperature303.15±n/a K
IC50 4±n/a nM
Commentsextracted
Citation Angst, DGessier, FVulpetti, A Amino pyrimidine derivatives US Patent US9512084 Publication Date 12/6/2016
 
Tyrosine-protein kinase BTK
Name:Tyrosine-protein kinase BTK
Type:Enzyme
Mol. Mass.:76289.95
Organism:Homo sapiens (Human)
Description:Q06187
Residue:659
BDBM259433
NameBDBM259433
Synonyms:US10457647, Example 32 US11673868, Example 32 | US9512084, 32
TypeSmall organic molecule
Emp. Form.C30H28F3N5O3
Mol. Mass.563.5702
SMILESCC#CC(=O)N1C[C@H](F)C[C@H]1COc1c(N)ncnc1-c1cc(F)cc(NC(=O)c2ccc(cc2F)C2CC2)c1C