Reaction Details
TargetTyrosine-protein kinase BTK
LigandBDBM259438
Substrate/Competitorn/a
Meas. Tech.Biochemical Enzyme Assay
pH7.5±n/a
Temperature303.15±n/a K
IC50 32±n/a nM
Commentsextracted
Citation Angst, DGessier, FVulpetti, A Amino pyrimidine derivatives US Patent US9512084 Publication Date 12/6/2016
 
Tyrosine-protein kinase BTK
Name:Tyrosine-protein kinase BTK
Type:Enzyme
Mol. Mass.:76289.95
Organism:Homo sapiens (Human)
Description:Q06187
Residue:659
BDBM259438
NameBDBM259438
Synonyms:US10457647, Example 37 US11673868, Example 37 | US9512084, 37
TypeSmall organic molecule
Emp. Form.C30H31F2N5O3
Mol. Mass.547.5956
SMILESCc1c(NC(=O)c2ccc(cc2F)C2CC2)cc(F)cc1-c1ncnc(N)c1OC[C@@H]1CCCN(C1)C(=O)C=C