Reaction Details
TargetHistamine H4 receptor
LigandBDBM294364
Substrate/Competitorn/a
Meas. Tech.HotSpot Assay
pH7.5±n/a
Temperature298.15±n/a K
IC50 67.0±n/a nM
Commentsextracted
Citation Ho, PSYoon, DOHan, SYLee, WIKim, JSPark, WSAhn, SOKim, HJ Substituted tricyclic heterocycles as histamine 4 receptor inhibitors US Patent US9586959 Publication Date 3/7/2017
 
Histamine H4 receptor
Name:Histamine H4 receptor
Type:G Protein-Coupled Receptor (GPCR)
Mol. Mass.:44517.02
Organism:Homo sapiens (Human)
Description:Binding assays were using CHO cells stably expressing hH4R receptors.
Residue:390
BDBM294364
NameBDBM294364
Synonyms:US9586959, Compound 12
TypeSmall organic molecule
Emp. Form.C13H14BrN7
Mol. Mass.348.201
SMILESCN1CCN(CC1)c1nc2ncc(Br)cc2n2cnnc12