Reaction Details
TargetHistamine H4 receptor
LigandBDBM294366
Substrate/Competitorn/a
Meas. Tech.HotSpot Assay
pH7.5±n/a
Temperature298.15±n/a K
IC50 65.0±n/a nM
Commentsextracted
Citation Ho, PSYoon, DOHan, SYLee, WIKim, JSPark, WSAhn, SOKim, HJ Substituted tricyclic heterocycles as histamine 4 receptor inhibitors US Patent US9586959 Publication Date 3/7/2017
 
Histamine H4 receptor
Name:Histamine H4 receptor
Type:G Protein-Coupled Receptor (GPCR)
Mol. Mass.:44517.02
Organism:Homo sapiens (Human)
Description:Binding assays were using CHO cells stably expressing hH4R receptors.
Residue:390
BDBM294366
NameBDBM294366
Synonyms:US9586959, Compound 16
TypeSmall organic molecule
Emp. Form.C12H12BrN7
Mol. Mass.334.175
SMILESBrc1cnc2nc(N3CCNCC3)c3nncn3c2c1