Reaction Details
TargetHistamine H4 receptor
LigandBDBM294377
Substrate/Competitorn/a
Meas. Tech.HotSpot Assay
pH7.5±n/a
Temperature298.15±n/a K
IC50 49.0±n/a nM
Commentsextracted
Citation Ho, PSYoon, DOHan, SYLee, WIKim, JSPark, WSAhn, SOKim, HJ Substituted tricyclic heterocycles as histamine 4 receptor inhibitors US Patent US9586959 Publication Date 3/7/2017
 
Histamine H4 receptor
Name:Histamine H4 receptor
Type:G Protein-Coupled Receptor (GPCR)
Mol. Mass.:44517.02
Organism:Homo sapiens (Human)
Description:Binding assays were using CHO cells stably expressing hH4R receptors.
Residue:390
BDBM294377
NameBDBM294377
Synonyms:US9586959, Compound 29
TypeSmall organic molecule
Emp. Form.C15H16ClN7
Mol. Mass.329.787
SMILESClc1cnc2nc(N3CCN4CCCC4C3)c3nncn3c2c1