Reaction Details
TargetHistamine H4 receptor
LigandBDBM294414
Substrate/Competitorn/a
Meas. Tech.HotSpot Assay
pH7.5±n/a
Temperature298.15±n/a K
IC50 42.0±n/a nM
Commentsextracted
Citation Ho, PSYoon, DOHan, SYLee, WIKim, JSPark, WSAhn, SOKim, HJ Substituted tricyclic heterocycles as histamine 4 receptor inhibitors US Patent US9586959 Publication Date 3/7/2017
 
Histamine H4 receptor
Name:Histamine H4 receptor
Type:G Protein-Coupled Receptor (GPCR)
Mol. Mass.:44517.02
Organism:Homo sapiens (Human)
Description:Binding assays were using CHO cells stably expressing hH4R receptors.
Residue:390
BDBM294414
NameBDBM294414
Synonyms:US9586959, Compound 92
TypeSmall organic molecule
Emp. Form.C15H18ClN5O
Mol. Mass.319.789
SMILESCN1CCN(CC1)C1=Nc2ncc(Cl)cc2C2OC(C)=NC12