Reaction Details
TargetLow molecular weight phosphotyrosine protein phosphatase
LigandBDBM50054344
Substrate/Competitorn/a
Meas. Tech.Inhibition Assay
IC50 2340±20 nM
Citation Zhang, ZZeng, L Hydroxyindole carboxylic acid based inhibitors for oncogenic Src homology-2 domain containing protein tyrosine phosphatase-2 (SHP2) US Patent US9522881 Publication Date 12/20/2016
 
Low molecular weight phosphotyrosine protein phosphatase
Name:Low molecular weight phosphotyrosine protein phosphatase
Type:n/a
Mol. Mass.:18042.81
Organism:Homo sapiens (Human)
Description:P24666
Residue:158
BDBM50054344
NameBDBM50054344
Synonyms:CHEMBL3319356 US9844535, ID 11a-1 L97M74
TypeSmall organic molecule
Emp. Form.C28H20IN3O5S
Mol. Mass.637.445
SMILESCn1c(c(I)c2cc(C(O)=O)c(O)cc12)-c1cccc(NC(=O)C(=O)Nc2ccc(cc2)-c2ccsc2)c1