Reaction Details
TargetCannabinoid receptor 1
LigandBDBM260139
Substrate/Competitorn/a
Meas. Tech.cAMP Assay
Temperature310.15±n/a K
EC50 34.8±n/a nM
Commentsextracted
Citation Frei, BGobbi, LGrether, UKimbara, ANettekoven, MRoever, SRogers-Evans, MSchulz-Gasch, T Pyridine derivatives US Patent US9522886 Publication Date 12/20/2016
 
Cannabinoid receptor 1
Name:Cannabinoid receptor 1
Type:G Protein-Coupled Receptor (GPCR)
Mol. Mass.:52868.96
Organism:Homo sapiens (Human)
Description:P21554
Residue:472
BDBM260139
NameBDBM260139
Synonyms:US9522886, 87
TypeSmall organic molecule
Emp. Form.C21H22FN3O4
Mol. Mass.399.4155
SMILESNC(=O)CC1(CCOC1)NC(=O)c1ccc(C2CC2)c(Oc2ccc(F)cc2)n1