Reaction Details
TargetLysine-specific demethylase 5B
LigandBDBM277719
Substrate/Competitorn/a
Meas. Tech.Jarid1B Assay
IC50<100±n/a nM
Citation Kanouni, TStafford, JAVeal, JMWallace, MB Histone demethylase inhibitors US Patent US10336727 Publication Date 7/2/2019
 
Lysine-specific demethylase 5B
Name:Lysine-specific demethylase 5B
Type:Protein
Mol. Mass.:175659.67
Organism:Homo sapiens (Human)
Description:Q9UGL1
Residue:1544
BDBM277719
NameBDBM277719
Synonyms:3-{[1-(cyclopropylmethyl)-5-fluoro-1H-indazol-3-yl]amino}-pyridine-4-carboxylic acid US10336727, Example 16 | US9617242, Example 16
TypeSmall organic molecule
Emp. Form.C17H15FN4O2
Mol. Mass.326.325
SMILESOC(=O)c1ccncc1Nc1nn(CC2CC2)c2ccc(F)cc12