Reaction Details
TargetLysine-specific demethylase 5B
LigandBDBM277750
Substrate/Competitorn/a
Meas. Tech.Jarid1B Assay
IC50<100±n/a nM
Citation Kanouni, TStafford, JAVeal, JMWallace, MB Histone demethylase inhibitors US Patent US10336727 Publication Date 7/2/2019
 
Lysine-specific demethylase 5B
Name:Lysine-specific demethylase 5B
Type:Protein
Mol. Mass.:175659.67
Organism:Homo sapiens (Human)
Description:Q9UGL1
Residue:1544
BDBM277750
NameBDBM277750
Synonyms:3-({5-fluoro-1-[2-(piperidin-3-yl)ethyl]-1H-indazol-3-yl}amino)pyridine-4-carboxylic acid, trifluoroacetic acid salt US10336727, Example 47 | US9617242, Example 47
TypeSmall organic molecule
Emp. Form.C20H22FN5O2
Mol. Mass.383.4194
SMILESOC(=O)c1ccncc1Nc1nn(CCC2CCCNC2)c2ccc(F)cc12