Reaction Details
TargetIntegrase
LigandBDBM294643
Substrate/Competitorn/a
Meas. Tech.Anti-HIV Activity MT4 Assay
IC50 3.00±n/a nM
Citation Johns, BAVelthuisen, EJWeatherhead, JGSuwandi, LTemelkoff, D Isoindoline derivatives for use in the treatment of a viral infection US Patent US10112899 Publication Date 10/30/2018
 
Integrase
Name:Integrase
Synonyms:Human immunodeficiency virus type 1 integrase
Type:PROTEIN
Mol. Mass.:32231.48
Organism:Human immunodeficiency virus 1
Description:ChEMBL_90865
Residue:288
BDBM294643
NameBDBM294643
Synonyms:US10112899, Example 122
TypeSmall organic molecule
Emp. Form.C31H34FNO5
Mol. Mass.519.6038
SMILESCOc1cc(F)cc(c1)C(=O)N1Cc2c(C1)c(C)c(-c1ccc(C)cc1)c([C@H](OC(C)(C)C)C(O)=O)c2C