Reaction Details
TargetIntegrase
LigandBDBM294740
Substrate/Competitorn/a
Meas. Tech.Anti-HIV Activity MT4 Assay
IC50 3.00±n/a nM
Citation Johns, BAVelthuisen, EJWeatherhead, JGSuwandi, LTemelkoff, D Isoindoline derivatives for use in the treatment of a viral infection US Patent US10112899 Publication Date 10/30/2018
 
Integrase
Name:Integrase
Synonyms:Human immunodeficiency virus type 1 integrase
Type:PROTEIN
Mol. Mass.:32231.48
Organism:Human immunodeficiency virus 1
Description:ChEMBL_90865
Residue:288
BDBM294740
NameBDBM294740
TypeSmall organic molecule
Emp. Form.C33H43FN2O5
Mol. Mass.566.7033
SMILESCc1c2CN(Cc2c(C)c(-c2cc(F)c3OCCCc3c2C)c1[C@H](OC(C)(C)C)C(O)=O)C(=O)N1CCC(C)(C)C1