Reaction Details
TargetIntegrase
LigandBDBM294794
Substrate/Competitorn/a
Meas. Tech.Anti-HIV Activity MT4 Assay
IC50 4.00±n/a nM
Citation Johns, BAVelthuisen, EJWeatherhead, JGSuwandi, LTemelkoff, D Isoindoline derivatives for use in the treatment of a viral infection US Patent US10112899 Publication Date 10/30/2018
 
Integrase
Name:Integrase
Synonyms:Human immunodeficiency virus type 1 integrase
Type:PROTEIN
Mol. Mass.:32231.48
Organism:Human immunodeficiency virus 1
Description:ChEMBL_90865
Residue:288
BDBM294794
NameBDBM294794
Synonyms:US10112899, Example 265
TypeSmall organic molecule
Emp. Form.C31H33NO6
Mol. Mass.515.5968
SMILESCc1ccc(cc1)-c1c(C)c2CN(Cc2c(C)c1[C@H](OC(C)(C)C)C(O)=O)C(=O)c1ccc2OCOc2c1