Reaction Details
TargetIntegrase
LigandBDBM294850
Substrate/Competitorn/a
Meas. Tech.Anti-HIV Activity MT4 Assay
IC50 3.00±n/a nM
Citation Johns, BAVelthuisen, EJWeatherhead, JGSuwandi, LTemelkoff, D Isoindoline derivatives for use in the treatment of a viral infection US Patent US10112899 Publication Date 10/30/2018
 
Integrase
Name:Integrase
Synonyms:Human immunodeficiency virus type 1 integrase
Type:PROTEIN
Mol. Mass.:32231.48
Organism:Human immunodeficiency virus 1
Description:ChEMBL_90865
Residue:288
BDBM294850
NameBDBM294850
Synonyms:US10112899, Example 320
TypeSmall organic molecule
Emp. Form.C31H38F2N2O5
Mol. Mass.556.6406
SMILESCc1c2CN(Cc2c(C)c(-c2ccc3OCCCc3c2C)c1[C@H](OC(C)(C)C)C(O)=O)C(=O)N1CCC(F)(F)C1