Reaction Details
TargetTyrosine-protein kinase JAK1 [866-1154]
LigandBDBM50021655
Substrate/Competitorn/a
Meas. Tech.Kinase Assay
pH7.5±n/a
IC50 20.0±n/a nM
Commentsextracted
Citation Bursulaya, BFisch, ALajiness, JPMachauer, RMalekar, SPetrassi, HMRamazani, FRemond, AUllrich, TUsselmann, PVangrevelinghe, E Substituted indazoles for treating tendon and/or ligament injuries US Patent US10112907 Publication Date 10/30/2018
 
Tyrosine-protein kinase JAK1 [866-1154]
Name:Tyrosine-protein kinase JAK1 [866-1154]
Type:Protein
Mol. Mass.:33185.74
Organism:Homo sapiens (Human)
Description:P23458[866-1154]
Residue:289
BDBM50021655
NameBDBM50021655
Synonyms:DECERNOTINIB US10766894, Compound TABLE 1.2 VRT-831509 | VX-509
TypeSmall organic molecule
Emp. Form.C18H19F3N6O
Mol. Mass.392.3783
SMILESCC[C@@](C)(Nc1ccnc(n1)-c1c[nH]c2ncccc12)C(=O)NCC(F)(F)F