Reaction Details
TargetNon-receptor tyrosine-protein kinase TYK2 [888-1187]
LigandBDBM50311017
Substrate/Competitorn/a
Meas. Tech.Kinase Assay
pH7.5±n/a
IC50 30.0±n/a nM
Commentsextracted
Citation Bursulaya, BFisch, ALajiness, JPMachauer, RMalekar, SPetrassi, HMRamazani, FRemond, AUllrich, TUsselmann, PVangrevelinghe, E Substituted indazoles for treating tendon and/or ligament injuries US Patent US10112907 Publication Date 10/30/2018
 
Non-receptor tyrosine-protein kinase TYK2 [888-1187]
Name:Non-receptor tyrosine-protein kinase TYK2 [888-1187]
Type:Protein
Mol. Mass.:34527.73
Organism:Homo sapiens (Human)
Description:P29597[888-1187]
Residue:300
BDBM50311017
NameBDBM50311017
Synonyms:CHEMBL1078178 N-(cyanomethyl)-4-(2-(4-morpholinophenylamino)pyrimidin-4-yl)benzamide US10766894, Compound TABLE 1.4 US9469613, CYT-0387
TypeSmall organic molecule
Emp. Form.C23H22N6O2
Mol. Mass.414.4598
SMILESO=C(NCC#N)c1ccc(cc1)-c1ccnc(Nc2ccc(cc2)N2CCOCC2)n1