Reaction Details
TargetLysine-specific histone demethylase 1A
LigandBDBM256651
Substrate/Competitorn/a
Meas. Tech.Inhibition Activity Assay
IC50<100.0±n/a nM
Citation Matsumoto, SHattori, YToyofuku, MMorimoto, SDaini, MKojima, TKaku, TIto, M Cyclopropanamine compound and use thereof US Patent US10414761 Publication Date 9/17/2019
 
Lysine-specific histone demethylase 1A
Name:Lysine-specific histone demethylase 1A
Type:Enzyme
Mol. Mass.:92901.01
Organism:Homo sapiens (Human)
Description:O60341
Residue:852
BDBM256651
NameBDBM256651
Synonyms:US10053456, 30 US10968213, Example 30 US9718814, 30 | US9920047, 30
TypeSmall organic molecule
Emp. Form.C18H24F2N2OS
Mol. Mass.354.458
SMILESFC1(F)CCC(CC1)NC(=O)c1csc(c1)C1CC1NCC1CC1