Reaction Details
TargetUbiquitin carboxyl-terminal hydrolase 1
LigandBDBM325229
Substrate/Competitorn/a
Meas. Tech.Ubitquin-Rhodamine 110 Assay for USP1 Activity
IC50>2000±n/a nM
Citation Buckmelter, AJIoannidis, SFollows, BGustafson, GWang, MCaravella, JAWang, ZFritzen, ELLin, J Purinones as ubiquitin-specific protease 1 inhibitors US Patent US10399980 Publication Date 9/3/2019
 
Ubiquitin carboxyl-terminal hydrolase 1
Name:Ubiquitin carboxyl-terminal hydrolase 1
Type:PROTEIN
Mol. Mass.:88191.62
Organism:Homo sapiens (Human)
Description:ChEMBL_104169
Residue:785
BDBM325229
NameBDBM325229
Synonyms:2-(2-isopropylpyridin- US10399980, Compound I-435
TypeSmall organic molecule
Emp. Form.C28H30N8O
Mol. Mass.494.5908
SMILESCC(C)c1ncccc1-c1ncc2[nH]c(=O)n(Cc3ccc(cc3)-n3ccc(n3)C3CCNCC3)c2n1