Reaction Details
TargetUbiquitin carboxyl-terminal hydrolase 1
LigandBDBM325279
Substrate/Competitorn/a
Meas. Tech.Ubitquin-Rhodamine 110 Assay for USP1 Activity
IC50>2000±n/a nM
Citation Buckmelter, AJIoannidis, SFollows, BGustafson, GWang, MCaravella, JAWang, ZFritzen, ELLin, J Purinones as ubiquitin-specific protease 1 inhibitors US Patent US10399980 Publication Date 9/3/2019
 
Ubiquitin carboxyl-terminal hydrolase 1
Name:Ubiquitin carboxyl-terminal hydrolase 1
Type:PROTEIN
Mol. Mass.:88191.62
Organism:Homo sapiens (Human)
Description:ChEMBL_104169
Residue:785
BDBM325279
NameBDBM325279
Synonyms:1-(4-((2-(2- US10399980, Compound I-485 | US11161848, Compound I-485
TypeSmall organic molecule
Emp. Form.C27H32N6O3
Mol. Mass.488.5814
SMILESCOCCNC(=O)N(C)c1ccc(Cn2c3nc(ncc3n(C)c2=O)-c2ccccc2C(C)C)cc1