Reaction Details
TargetVoltage-dependent N-type calcium channel subunit alpha-1B
LigandBDBM164237
Substrate/Competitorn/a
Meas. Tech.High-Throughput Cav2.2/Kir2.3 T-Type Fluorescent Assay
IC50 4000±n/a nM
Citation PubChem, PCPajouhesh, HHolland, RZhang, LPajouhesh, HLamontagne, JWhelan, B Benzimidazole inhibitors of the sodium channel US Patent US9688615 Publication Date 6/27/2017
 
Voltage-dependent N-type calcium channel subunit alpha-1B
Name:Voltage-dependent N-type calcium channel subunit alpha-1B
Type:Enzyme
Mol. Mass.:262548.16
Organism:Homo sapiens (Human)
Description:Q00975
Residue:2339
BDBM164237
NameBDBM164237
Synonyms:US9688615, 48
TypeSmall organic molecule
Emp. Form.C17H20F6N4O
Mol. Mass.410.3573
SMILESCN(Cc1nc2cc(cc(c2[nH]1)C(F)(F)F)C(F)(F)F)C(=O)CNC(C)(C)C