Reaction Details
TargetVoltage-dependent T-type calcium channel subunit alpha-1G
LigandBDBM163526
Substrate/Competitorn/a
Meas. Tech.High-Throughput Cav3.1 T-Type Fluorescent Assay
IC50 60±n/a nM
Citation PubChem, PCPajouhesh, HHolland, RZhang, LPajouhesh, HLamontagne, JWhelan, B Benzimidazole inhibitors of the sodium channel US Patent US9688615 Publication Date 6/27/2017
 
Voltage-dependent T-type calcium channel subunit alpha-1G
Name:Voltage-dependent T-type calcium channel subunit alpha-1G
Type:PROTEIN
Mol. Mass.:262471.14
Organism:Homo sapiens (Human)
Description:ChEMBL_1515216
Residue:2377
BDBM163526
NameBDBM163526
Synonyms:US9688615, 1
TypeSmall organic molecule
Emp. Form.C13H11F6N3
Mol. Mass.323.237
SMILESFC(F)(F)c1cc(c2nc(CC3CNC3)[nH]c2c1)C(F)(F)F