Reaction Details
TargetVoltage-dependent T-type calcium channel subunit alpha-1G
LigandBDBM164223
Substrate/Competitorn/a
Meas. Tech.High-Throughput Cav3.1 T-Type Fluorescent Assay
IC50 2350±n/a nM
Citation PubChem, PCPajouhesh, HHolland, RZhang, LPajouhesh, HLamontagne, JWhelan, B Benzimidazole inhibitors of the sodium channel US Patent US9688615 Publication Date 6/27/2017
 
Voltage-dependent T-type calcium channel subunit alpha-1G
Name:Voltage-dependent T-type calcium channel subunit alpha-1G
Type:PROTEIN
Mol. Mass.:262471.14
Organism:Homo sapiens (Human)
Description:ChEMBL_1515216
Residue:2377
BDBM164223
NameBDBM164223
Synonyms:US9688615, 34
TypeSmall organic molecule
Emp. Form.C13H13F6N3
Mol. Mass.325.2528
SMILESCC(C)(N)Cc1nc2cc(cc(c2[nH]1)C(F)(F)F)C(F)(F)F