Reaction Details
TargetVoltage-dependent T-type calcium channel subunit alpha-1H
LigandBDBM164227
Substrate/Competitorn/a
Meas. Tech.High-Throughput Cav3.1 T-Type Fluorescent Assay
IC50 3800±n/a nM
Citation PubChem, PCPajouhesh, HHolland, RZhang, LPajouhesh, HLamontagne, JWhelan, B Benzimidazole inhibitors of the sodium channel US Patent US9688615 Publication Date 6/27/2017
 
Voltage-dependent T-type calcium channel subunit alpha-1H
Name:Voltage-dependent T-type calcium channel subunit alpha-1H
Type:Enzyme Catalytic Domain
Mol. Mass.:259187.68
Organism:Homo sapiens (Human)
Description:Calcium channel (Type T,L) 0 0::O95180
Residue:2353
BDBM164227
NameBDBM164227
Synonyms:US9688615, 38
TypeSmall organic molecule
Emp. Form.C10H7F6N3
Mol. Mass.283.1731
SMILESNCc1nc2cc(c(cc2[nH]1)C(F)(F)F)C(F)(F)F