Reaction Details
TargetVoltage-dependent T-type calcium channel subunit alpha-1H
LigandBDBM164324
Substrate/Competitorn/a
Meas. Tech.High-Throughput Cav3.1 T-Type Fluorescent Assay
IC50 640±n/a nM
Citation PubChem, PCPajouhesh, HHolland, RZhang, LPajouhesh, HLamontagne, JWhelan, B Benzimidazole inhibitors of the sodium channel US Patent US9688615 Publication Date 6/27/2017
 
Voltage-dependent T-type calcium channel subunit alpha-1H
Name:Voltage-dependent T-type calcium channel subunit alpha-1H
Type:Enzyme Catalytic Domain
Mol. Mass.:259187.68
Organism:Homo sapiens (Human)
Description:Calcium channel (Type T,L) 0 0::O95180
Residue:2353
BDBM164324
NameBDBM164324
Synonyms:US9688615, 135
TypeSmall organic molecule
Emp. Form.C15H15F6N3
Mol. Mass.351.2901
SMILESFC(F)(F)c1cc(c2[nH]c(CC3CCNCC3)nc2c1)C(F)(F)F