Reaction Details
TargetVoltage-dependent T-type calcium channel subunit alpha-1H
LigandBDBM164362
Substrate/Competitorn/a
Meas. Tech.High-Throughput Cav3.1 T-Type Fluorescent Assay
IC50 2100±n/a nM
Citation PubChem, PCPajouhesh, HHolland, RZhang, LPajouhesh, HLamontagne, JWhelan, B Benzimidazole inhibitors of the sodium channel US Patent US9688615 Publication Date 6/27/2017
 
Voltage-dependent T-type calcium channel subunit alpha-1H
Name:Voltage-dependent T-type calcium channel subunit alpha-1H
Type:Enzyme Catalytic Domain
Mol. Mass.:259187.68
Organism:Homo sapiens (Human)
Description:Calcium channel (Type T,L) 0 0::O95180
Residue:2353
BDBM164362
NameBDBM164362
Synonyms:US9688615, 173
TypeSmall organic molecule
Emp. Form.C17H18F6N4O
Mol. Mass.408.3414
SMILESN[C@H]1CCCC[C@H]1C(=O)NCc1nc2cc(cc(c2[nH]1)C(F)(F)F)C(F)(F)F