Reaction Details
TargetSodium channel protein type 5 subunit alpha
LigandBDBM164223
Substrate/Competitorn/a
Meas. Tech.Nav1.5 Assay
pH7.4±n/a
IC50 3600±n/a nM
Commentsextracted
Citation PubChem, PCPajouhesh, HHolland, RZhang, LPajouhesh, HLamontagne, JWhelan, B Benzimidazole inhibitors of the sodium channel US Patent US9688615 Publication Date 6/27/2017
 
Sodium channel protein type 5 subunit alpha
Name:Sodium channel protein type 5 subunit alpha
Type:Enzyme
Mol. Mass.:226908.60
Organism:Homo sapiens (Human)
Description:Q14524
Residue:2016
BDBM164223
NameBDBM164223
Synonyms:US9688615, 34
TypeSmall organic molecule
Emp. Form.C13H13F6N3
Mol. Mass.325.2528
SMILESCC(C)(N)Cc1nc2cc(cc(c2[nH]1)C(F)(F)F)C(F)(F)F