Reaction Details
TargetLysine-specific demethylase 4C
LigandBDBM296101
Substrate/Competitorn/a
Meas. Tech.JMJD2C Assay
Temperature298.15±n/a K
IC50<100±n/a nM
Commentsextracted
Citation Boloor, AKanouni, TStafford, JAVeal, JMWallace, MB Histone demethylase inhibitors US Patent US10112940 Publication Date 10/30/2018
 
Lysine-specific demethylase 4C
Name:Lysine-specific demethylase 4C
Type:Protein
Mol. Mass.:119979.01
Organism:Homo sapiens (Human)
Description:Q9H3R0
Residue:1056
BDBM296101
NameBDBM296101
Synonyms:2-{4-[methyl-(1,2,3,4-tetrahydro- naphthalen-1-ylmethyl)-amino]-phenoxy}- pyrido[3,4-d]pyrimidin-4-ol US10202381, Example 28 US10611763, Example 28 US11535616, Example 28
TypeSmall organic molecule
Emp. Form.C25H24N4O2
Mol. Mass.412.4837
SMILESCN(CC1CCCc2ccccc12)c1ccc(Oc2nc(O)c3ccncc3n2)cc1