Reaction Details
TargetLysine-specific demethylase 4C
LigandBDBM296107
Substrate/Competitorn/a
Meas. Tech.JMJD2C Assay
Temperature298.15±n/a K
IC50<100±n/a nM
Commentsextracted
Citation Boloor, AKanouni, TStafford, JAVeal, JMWallace, MB Histone demethylase inhibitors US Patent US10112940 Publication Date 10/30/2018
 
Lysine-specific demethylase 4C
Name:Lysine-specific demethylase 4C
Type:Protein
Mol. Mass.:119979.01
Organism:Homo sapiens (Human)
Description:Q9H3R0
Residue:1056
BDBM296107
NameBDBM296107
Synonyms:2-{4-[(5-isopropyl-pyridin-2-yl)-methyl- amino]-phenoxy}-pyrido[3,4-d]pyrimidin- 4-ol US10202381, Example 34 US10611763, Example 34 US11535616, Example 34
TypeSmall organic molecule
Emp. Form.C22H21N5O2
Mol. Mass.387.4344
SMILESCC(C)c1ccc(nc1)N(C)c1ccc(Oc2nc(O)c3ccncc3n2)cc1