Reaction Details
TargetToll-like receptor 7
LigandBDBM273230
Substrate/Competitorn/a
Meas. Tech.Biological Assay
IC50 0.300±n/a nM
Citation Dyckman, AJDodd, DSMussari, CPPasunoori, LKumar, SR [1,2,4]triazolo[1,5-a]pyridinyl substituted indole compounds US Patent US10478424 Publication Date 11/19/2019
 
Toll-like receptor 7
Name:Toll-like receptor 7
Type:Enzyme
Mol. Mass.:120945.35
Organism:Homo sapiens (Human)
Description:Q9NYK1
Residue:1049
BDBM273230
NameBDBM273230
Synonyms:6-(3-isopropyl-5-(piperidin-4-yl)-1H-indol-2-yl)-7,8-dimethyl-[1,2,4]triazolo[1,5-a]pyridine dihydrochloride US10478424, Example 4
TypeSmall organic molecule
Emp. Form.C24H29N5
Mol. Mass.387.5206
SMILESCC(C)c1c([nH]c2ccc(cc12)C1CCNCC1)-c1cn2ncnc2c(C)c1C