Reaction Details
TargetReplicase polyprotein 1ab
LigandBDBM420298
Substrate/Competitorn/a
Meas. Tech.Coronavirus 3C Protease FRET Assay
IC50 4.00±n/a nM
Citation Hoffman, RLKania, RSNieman, JAPlanken, SPIii, GJ Anticoronviral compounds and compositions, their pharmaceutical uses and materials for their synthesis WIPOWO2005113580 Publication Date 12/1/2005
 
Replicase polyprotein 1ab
Name:Replicase polyprotein 1ab
Type:Protein
Mol. Mass.:790250.81
Organism:Human SARS coronavirus (SARS-CoV) (Severe acute respiratory syndrome coronavirus)
Description:P0C6X7
Residue:7073
BDBM420298
NameBDBM420298
Synonyms:CVD-0006356 PF-0835231 US11753373, Compound A-5-d WO2021205298, Compound 1 | cmdc.202100576, 6b
TypeSmall organic molecule
Emp. Form.C24H32N4O6
Mol. Mass.472.5341
SMILESCOc1cccc2[nH]c(cc12)C(=O)N[C@@H](CC(C)C)C(=O)N[C@@H](C[C@@H]1CCNC1=O)C(=O)CO