Reaction Details
TargetReplicase polyprotein 1ab
LigandBDBM423414
Substrate/Competitorn/a
Meas. Tech.Coronavirus 3C Protease FRET Assay
IC50 20±n/a nM
Citation Hoffman, RLKania, RSNieman, JAPlanken, SPIii, GJ Anticoronviral compounds and compositions, their pharmaceutical uses and materials for their synthesis WIPOWO2005113580 Publication Date 12/1/2005
 
Replicase polyprotein 1ab
Name:Replicase polyprotein 1ab
Type:Protein
Mol. Mass.:790250.81
Organism:Human SARS coronavirus (SARS-CoV) (Severe acute respiratory syndrome coronavirus)
Description:P0C6X7
Residue:7073
BDBM423414
NameBDBM423414
Synonyms:WO2005113580-Ex-08 | cmdc.202100576, 24c
TypeSmall Organic Molecule
Emp. Form.C24H32N4O6
Mol. Mass.472.5341
SMILESCCCC[C@H](NC(=O)c1cc2c(OC)cccc2[nH]1)C(=O)N[C@@H](C[C@@H]1CCNC1=O)C(=O)CO