Reaction Details
TargetReplicase polyprotein 1ab
LigandBDBM423415
Substrate/Competitorn/a
Meas. Tech.Coronavirus 3C Protease FRET Assay
IC50 34±n/a nM
Citation Hoffman, RLKania, RSNieman, JAPlanken, SPIii, GJ Anticoronviral compounds and compositions, their pharmaceutical uses and materials for their synthesis WIPOWO2005113580 Publication Date 12/1/2005
 
Replicase polyprotein 1ab
Name:Replicase polyprotein 1ab
Type:Protein
Mol. Mass.:790250.81
Organism:Human SARS coronavirus (SARS-CoV) (Severe acute respiratory syndrome coronavirus)
Description:P0C6X7
Residue:7073
BDBM423415
NameBDBM423415
Synonyms:WO2005113580-Ex-10
TypeSmall Organic Molecule
Emp. Form.C25H34N4O6
Mol. Mass.486.5607
SMILESCOc1cccc2[nH]c(cc12)C(=O)N[C@@H](CCC(C)C)C(=O)N[C@@H](C[C@@H]1CCNC1=O)C(=O)CO