Reaction Details
TargetReplicase polyprotein 1ab
LigandBDBM423417
Substrate/Competitorn/a
Meas. Tech.Coronavirus 3C Protease FRET Assay
IC50 36±n/a nM
Citation Hoffman, RLKania, RSNieman, JAPlanken, SPIii, GJ Anticoronviral compounds and compositions, their pharmaceutical uses and materials for their synthesis WIPOWO2005113580 Publication Date 12/1/2005
 
Replicase polyprotein 1ab
Name:Replicase polyprotein 1ab
Type:Protein
Mol. Mass.:790250.81
Organism:Human SARS coronavirus (SARS-CoV) (Severe acute respiratory syndrome coronavirus)
Description:P0C6X7
Residue:7073
BDBM423417
NameBDBM423417
Synonyms:WO2005113580-Ex-11
TypeSmall Organic Molecule
Emp. Form.C26H36N4O6
Mol. Mass.500.5872
SMILESCOCC(=O)[C@H](C[C@@H]1CCNC1=O)NC(=O)[C@H](CCC(C)C)NC(=O)c1cc2c(OC)cccc2[nH]1