Reaction Details
TargetReplicase polyprotein 1ab
LigandBDBM423465
Substrate/Competitorn/a
Meas. Tech.Coronavirus 3C Protease FRET Assay
IC50 20±n/a nM
Citation Hoffman, RLKania, RSNieman, JAPlanken, SPIii, GJ Anticoronviral compounds and compositions, their pharmaceutical uses and materials for their synthesis WIPOWO2005113580 Publication Date 12/1/2005
 
Replicase polyprotein 1ab
Name:Replicase polyprotein 1ab
Type:Protein
Mol. Mass.:790250.81
Organism:Human SARS coronavirus (SARS-CoV) (Severe acute respiratory syndrome coronavirus)
Description:P0C6X7
Residue:7073
BDBM423465
NameBDBM423465
Synonyms:US11753373, Compound A-1-c WO2006061714-ID-10 | cmdc.202100576, 10b
TypeSmall Organic Molecule
Emp. Form.C22H28N4O4
Mol. Mass.412.4821
SMILESCC(C)C[C@H](NC(=O)c1cc2ccccc2[nH]1)C(=O)N[C@@H](C[C@@H]1CCNC1=O)C=O