Reaction Details
TargetTyrosine-protein kinase BTK
LigandBDBM165458
Substrate/Competitorn/a
Meas. Tech.Btk Enzyme Assay
pH7.4±n/a
Temperature298.15±n/a K
IC50 0.05±n/a nM
Commentsextracted
Citation Liu, QWatterson, SHAhmad, S Indole carboxamide compounds US Patent US9688629 Publication Date 6/27/2017
 
Tyrosine-protein kinase BTK
Name:Tyrosine-protein kinase BTK
Type:Enzyme
Mol. Mass.:76289.95
Organism:Homo sapiens (Human)
Description:Q06187
Residue:659
BDBM165458
NameBDBM165458
Synonyms:US10604504, Example 136 US9688629, 136 US9920031, Example 136
TypeSmall organic molecule
Emp. Form.C22H25FN4O2
Mol. Mass.396.4579
SMILESCc1[nH]c2c(cc(F)c(N3CCC[C@@H](C3)NC(=O)C#CC3CC3)c2c1C)C(N)=O