Reaction Details
TargetArginase-2, mitochondrial
LigandBDBM290403
Substrate/Competitorn/a
Meas. Tech.Inhibition Assay
IC50 1000±n/a nM
Citation Van Zandt, MJagdmann, GE Arginase inhibitors as therapeutics US Patent US10603330 Publication Date 3/31/2020
 
Arginase-2, mitochondrial
Name:Arginase-2, mitochondrial
Type:PROTEIN
Mol. Mass.:38576.93
Organism:Homo sapiens (Human)
Description:ChEMBL_978892
Residue:354
BDBM290403
NameBDBM290403
Synonyms:(3R,4S)-3-amino-4-(3-boronopropyl)-1-(((S)-1,2,3,4- tetrahydroisoquinolin-3-yl)methyl)pyrrolidine-3-carboxylic acid US10603330, Example 39 | US11389464, Example 39
TypeSmall organic molecule
Emp. Form.C18H28BN3O4
Mol. Mass.361.244
SMILESN[C@]1(CN(C[C@@H]2Cc3ccccc3CN2)C[C@@H]1CCCB(O)O)C(O)=O