Reaction Details
TargetArginase-1
LigandBDBM290417
Substrate/Competitorn/a
Meas. Tech.Inhibition Assay
IC50 1000±n/a nM
Citation Van Zandt, MJagdmann, GE Arginase inhibitors as therapeutics US Patent US10603330 Publication Date 3/31/2020
 
Arginase-1
Name:Arginase-1
Type:PROTEIN
Mol. Mass.:34737.53
Organism:Homo sapiens (Human)
Description:ChEMBL_978893
Residue:322
BDBM290417
NameBDBM290417
Synonyms:(3R,4S)-3-amino-4-(3-boronopropyl)-1-(1,2,3,4- tetrahydroisoquinoline-3-carbonyl)pyrrolidine-3-carboxylic acid US10603330, Example 53 | US11389464, Example 53
TypeSmall organic molecule
Emp. Form.C18H26BN3O5
Mol. Mass.375.227
SMILESN[C@]1(CN(C[C@@H]1CCCB(O)O)C(=O)C1Cc2ccccc2CN1)C(O)=O