Reaction Details
TargetProtein arginine N-methyltransferase 5
LigandBDBM297736
Substrate/Competitorn/a
Meas. Tech.PRMT5 Biochemical Assay
IC50<100±n/a nM
Citation Duncan, KWChesworth, RBoriack-Sjodin, PAMunchhof, MJ PRMT5 inhibitors and uses thereof US Patent US10118918 Publication Date 11/6/2018
 
Protein arginine N-methyltransferase 5
Name:Protein arginine N-methyltransferase 5
Type:Enzyme
Mol. Mass.:72679.99
Organism:Homo sapiens (Human)
Description:O14744
Residue:637
BDBM297736
NameBDBM297736
Synonyms:2-(2-(N,N-dimethylsulfamoyl)phenoxy)-N-(2-hydroxy-3-(isoindolin-2-yl)propyl)acetamide US9732072, Compound 15
TypeSmall organic molecule
Emp. Form.C21H27N3O5S
Mol. Mass.433.521
SMILESCN(C)S(=O)(=O)c1ccccc1OCC(=O)NCC(O)CN1Cc2ccccc2C1