Reaction Details
TargetProtein arginine N-methyltransferase 5
LigandBDBM297745
Substrate/Competitorn/a
Meas. Tech.PRMT5 Biochemical Assay
IC50<100±n/a nM
Citation Duncan, KWChesworth, RBoriack-Sjodin, PAMunchhof, MJ PRMT5 inhibitors and uses thereof US Patent US10118918 Publication Date 11/6/2018
 
Protein arginine N-methyltransferase 5
Name:Protein arginine N-methyltransferase 5
Type:Enzyme
Mol. Mass.:72679.99
Organism:Homo sapiens (Human)
Description:O14744
Residue:637
BDBM297745
NameBDBM297745
Synonyms:US10118918, Compound 24 | US9732072, Compound 24
TypeSmall organic molecule
Emp. Form.C23H29N3O3
Mol. Mass.395.4947
SMILESO[C@H](CNC(=O)c1cccc(NC2CCOCC2)c1)CN1Cc2ccccc2C1