Reaction Details
TargetAtaxin-2
LigandBDBM258540
Substrate/Competitorn/a
Meas. Tech.Enzyme Inhibition Assay
IC50 44.0±n/a nM
Citation Hunziker, DMattei, PMauser, HPrunotto, MUllmer, C Diazaspirocycloalkane and azaspirocycloalkane US Patent US10633384 Publication Date 4/28/2020
 
Ataxin-2
Name:Ataxin-2
Type:n/a
Mol. Mass.:140337.65
Organism:Homo sapiens (Human)
Description:Q99700
Residue:1313
BDBM258540
NameBDBM258540
Synonyms:US10633384, Example 12.02 | US9493486, 12.02
TypeSmall organic molecule
Emp. Form.C22H21Cl2N5O3
Mol. Mass.474.34
SMILESClc1ccc(COC(=O)N2CCC3(CN(C3)C(=O)c3ccc4[nH]nnc4c3)CC2)cc1Cl